Reaction Details
TargetMu-type opioid receptor
LigandBDBM50398762
Substrate/Competitorn/a
Meas. Tech.ChEMBL_876436 (CHEMBL2186797)
Ki 13±n/a nM
Citation Ananthan, SSaini, SKDersch, CMXu, HMcGlinchey, NGiuvelis, DBilsky, EJRothman, RB 14-Alkoxy- and 14-acyloxypyridomorphinans:µ agonist/d antagonist opioid analgesics with diminished tolerance and dependence side effects. J Med Chem55:8350-63 (2012) 
 
Mu-type opioid receptor
Name:Mu-type opioid receptor
Type:G Protein-Coupled Receptor (GPCR)
Mol. Mass.:44789.51
Organism:Homo sapiens (Human)
Description:P35372
Residue:400
BDBM50398762
NameBDBM50398762
Synonyms:CHEMBL2179663
TypeSmall organic molecule
Emp. Form.C29H25ClN2O2
Mol. Mass.468.974
SMILESOc1ccc2C[C@H]3N(CC4CC4)CC[C@@]45[C@@H](Oc1c24)c1ncc(cc1C=C35)-c1ccc(Cl)cc1