Reaction Details
TargetProtein-tyrosine kinase 2-beta
LigandBDBM50402994
Substrate/Competitorn/a
Meas. Tech.ChEMBL_885500 (CHEMBL2209552)
IC50 1700±n/a nM
Citation Bhattacharya, SKAspnes, GEBagley, SWBoehm, MBrosius, ADBuckbinder, LChang, JSDibrino, JEng, HFrederick, KSGriffith, DAGriffor, MCGuimarães, CRGuzman-Perez, AHan, SKalgutkar, ASKlug-McLeod, JGarcia-Irizarry, CLi, JLippa, BPrice, DASouthers, JAWalker, DPWei, LXiao, JZawistoski, MPZhao, X Identification of novel series of pyrazole and indole-urea based DFG-out PYK2 inhibitors. Bioorg Med Chem Lett22:7523-9 (2012) 
 
Protein-tyrosine kinase 2-beta
Name:Protein-tyrosine kinase 2-beta
Type:Protein
Mol. Mass.:115868.80
Organism:Homo sapiens (Human)
Description:Q14289
Residue:1009
BDBM50402994
NameBDBM50402994
Synonyms:CHEMBL2207426
TypeSmall organic molecule
Emp. Form.C25H28N6O2
Mol. Mass.444.5288
SMILESCNC(=O)c1cc2cccc(NC(=O)Nc3cc(nn3-c3ccc(C)cc3)C(C)(C)C)c2[nH]1