Reaction Details
TargetProtein-tyrosine kinase 2-beta
LigandBDBM50403005
Substrate/Competitorn/a
Meas. Tech.ChEMBL_885500 (CHEMBL2209552)
IC50 225±n/a nM
Citation Bhattacharya, SKAspnes, GEBagley, SWBoehm, MBrosius, ADBuckbinder, LChang, JSDibrino, JEng, HFrederick, KSGriffith, DAGriffor, MCGuimarães, CRGuzman-Perez, AHan, SKalgutkar, ASKlug-McLeod, JGarcia-Irizarry, CLi, JLippa, BPrice, DASouthers, JAWalker, DPWei, LXiao, JZawistoski, MPZhao, X Identification of novel series of pyrazole and indole-urea based DFG-out PYK2 inhibitors. Bioorg Med Chem Lett22:7523-9 (2012) 
 
Protein-tyrosine kinase 2-beta
Name:Protein-tyrosine kinase 2-beta
Type:Protein
Mol. Mass.:115868.80
Organism:Homo sapiens (Human)
Description:Q14289
Residue:1009
BDBM50403005
NameBDBM50403005
Synonyms:CHEMBL2207822
TypeSmall organic molecule
Emp. Form.C25H28N6O2
Mol. Mass.444.5288
SMILESCOc1ccc(cc1)-c1cc(NC(=O)Nc2cc(nn2-c2ccc(C)cc2)C(C)(C)C)[nH]n1