Reaction Details
TargetFocal adhesion kinase 1
LigandBDBM50403002
Substrate/Competitorn/a
Meas. Tech.ChEMBL_885494 (CHEMBL2209546)
IC50>10000±n/a nM
Citation Bhattacharya, SKAspnes, GEBagley, SWBoehm, MBrosius, ADBuckbinder, LChang, JSDibrino, JEng, HFrederick, KSGriffith, DAGriffor, MCGuimarães, CRGuzman-Perez, AHan, SKalgutkar, ASKlug-McLeod, JGarcia-Irizarry, CLi, JLippa, BPrice, DASouthers, JAWalker, DPWei, LXiao, JZawistoski, MPZhao, X Identification of novel series of pyrazole and indole-urea based DFG-out PYK2 inhibitors. Bioorg Med Chem Lett22:7523-9 (2012) 
 
Focal adhesion kinase 1
Name:Focal adhesion kinase 1
Type:Tyrosine-protein kinase
Mol. Mass.:119233.17
Organism:Homo sapiens (Human)
Description:Q05397
Residue:1052
BDBM50403002
NameBDBM50403002
Synonyms:CHEMBL2207430
TypeSmall organic molecule
Emp. Form.C29H36N6O3
Mol. Mass.516.6345
SMILESCCOCCCNC(=O)c1cc2cccc(NC(=O)Nc3cc(nn3-c3ccc(C)cc3)C(C)(C)C)c2[nH]1