Reaction Details
TargetHistamine H1 receptor
LigandBDBM50220453
Substrate/Competitorn/a
Meas. Tech.ChEMBL_84552 (CHEMBL692987)
Ki 21380±n/a nM
Citation Faghih, RDwight, WBlack, LLiu, HGentles, RPhelan, KEsbenshade, TAIreland, LMiller, TRKang, CHKrueger, KMFox, GBHancock, AABennani, YL Structure-activity relationships of non-imidazole H(3) receptor ligands. Part 2: binding preference for D-amino acids motifs. Bioorg Med Chem Lett12:2035-7 (2002) Histamine H1 receptor
Name:Histamine H1 receptor
Type:G Protein-Coupled Receptor (GPCR)
Mol. Mass.:55808.72
Organism:Homo sapiens (Human)
Description:Cell pellets from SK-N-MC cells transfected with human H1 receptor were used in binding assay.
Residue:487
BDBM50220453
NameBDBM50220453
Synonyms:CHEMBL312958
TypeSmall organic molecule
Emp. Form.C29H47N3O5
Mol. Mass.517.7006
SMILESCCCCCC(=O)c1ccc(OCCCN2CCN(CC2)C(=O)[C@@H](NC(=O)OC(C)(C)C)C(C)C)cc1