Reaction Details
TargetHistamine H3 receptor
LigandBDBM50220460
Substrate/Competitorn/a
Meas. Tech.ChEMBL_86931 (CHEMBL697540)
Ki 8.7±n/a nM
Citation Faghih, RDwight, WBlack, LLiu, HGentles, RPhelan, KEsbenshade, TAIreland, LMiller, TRKang, CHKrueger, KMFox, GBHancock, AABennani, YL Structure-activity relationships of non-imidazole H(3) receptor ligands. Part 2: binding preference for D-amino acids motifs. Bioorg Med Chem Lett12:2035-7 (2002) Histamine H3 receptor
Name:Histamine H3 receptor
Type:G Protein-Coupled Receptor (GPCR)
Mol. Mass.:48607.98
Organism:Rattus norvegicus (rat)
Description:n/a
Residue:445
BDBM50220460
NameBDBM50220460
Synonyms:CHEMBL304888
TypeSmall organic molecule
Emp. Form.C23H35N3O3
Mol. Mass.401.5423
SMILESCC(C)N[C@H](C)C(=O)N1CCN(CCCOc2ccc(cc2)C(=O)C2CC2)CC1