Reaction Details
TargetHistamine H1 receptor
LigandBDBM50220434
Substrate/Competitorn/a
Meas. Tech.ChEMBL_84552 (CHEMBL692987)
Ki 46774±n/a nM
Citation Faghih, RDwight, WBlack, LLiu, HGentles, RPhelan, KEsbenshade, TAIreland, LMiller, TRKang, CHKrueger, KMFox, GBHancock, AABennani, YL Structure-activity relationships of non-imidazole H(3) receptor ligands. Part 2: binding preference for D-amino acids motifs. Bioorg Med Chem Lett12:2035-7 (2002) Histamine H1 receptor
Name:Histamine H1 receptor
Type:G Protein-Coupled Receptor (GPCR)
Mol. Mass.:55808.72
Organism:Homo sapiens (Human)
Description:Cell pellets from SK-N-MC cells transfected with human H1 receptor were used in binding assay.
Residue:487
BDBM50220434
NameBDBM50220434
Synonyms:CHEMBL291821
TypeSmall organic molecule
Emp. Form.C22H33N3O3
Mol. Mass.387.5157
SMILESCCC[C@@H](N)C(=O)N1CCN(CCCOc2ccc(cc2)C(=O)C2CC2)CC1