Reaction Details
TargetHistamine H2 receptor
LigandBDBM50220439
Substrate/Competitorn/a
Meas. Tech.ChEMBL_85658 (CHEMBL702650)
Ki 10000±n/a nM
Citation Faghih, RDwight, WBlack, LLiu, HGentles, RPhelan, KEsbenshade, TAIreland, LMiller, TRKang, CHKrueger, KMFox, GBHancock, AABennani, YL Structure-activity relationships of non-imidazole H(3) receptor ligands. Part 2: binding preference for D-amino acids motifs. Bioorg Med Chem Lett12:2035-7 (2002) Histamine H2 receptor
Name:Histamine H2 receptor
Type:G Protein-Coupled Receptor (GPCR)
Mol. Mass.:40115.31
Organism:Homo sapiens (Human)
Description:n/a
Residue:359
BDBM50220439
NameBDBM50220439
Synonyms:CHEMBL64059
TypeSmall organic molecule
Emp. Form.C27H35N3O3
Mol. Mass.449.5851
SMILESN[C@H](CCc1ccccc1)C(=O)N1CCN(CCCOc2ccc(cc2)C(=O)C2CC2)CC1