Reaction Details
TargetHistamine H2 receptor
LigandBDBM50220455
Substrate/Competitorn/a
Meas. Tech.ChEMBL_85658 (CHEMBL702650)
Ki 19055±n/a nM
Citation Faghih, RDwight, WBlack, LLiu, HGentles, RPhelan, KEsbenshade, TAIreland, LMiller, TRKang, CHKrueger, KMFox, GBHancock, AABennani, YL Structure-activity relationships of non-imidazole H(3) receptor ligands. Part 2: binding preference for D-amino acids motifs. Bioorg Med Chem Lett12:2035-7 (2002) Histamine H2 receptor
Name:Histamine H2 receptor
Type:G Protein-Coupled Receptor (GPCR)
Mol. Mass.:40115.31
Organism:Homo sapiens (Human)
Description:n/a
Residue:359
BDBM50220455
NameBDBM50220455
Synonyms:CHEMBL434785
TypeSmall organic molecule
Emp. Form.C11H13NO2
Mol. Mass.191.2264
SMILESN[C@H](C1Cc2ccccc2C1)C(O)=O