Reaction Details
TargetHistamine H3 receptor
LigandBDBM50220467
Substrate/Competitorn/a
Meas. Tech.ChEMBL_86931 (CHEMBL697540)
Ki 1.9±n/a nM
Citation Faghih, RDwight, WBlack, LLiu, HGentles, RPhelan, KEsbenshade, TAIreland, LMiller, TRKang, CHKrueger, KMFox, GBHancock, AABennani, YL Structure-activity relationships of non-imidazole H(3) receptor ligands. Part 2: binding preference for D-amino acids motifs. Bioorg Med Chem Lett12:2035-7 (2002) Histamine H3 receptor
Name:Histamine H3 receptor
Type:G Protein-Coupled Receptor (GPCR)
Mol. Mass.:48607.98
Organism:Rattus norvegicus (rat)
Description:n/a
Residue:445
BDBM50220467
NameBDBM50220467
Synonyms:CHEMBL62421
TypeSmall organic molecule
Emp. Form.C22H35N3O3
Mol. Mass.389.5316
SMILESCCCCCC(=O)c1ccc(OCCCN2CCN(CC2)C(=O)[C@@H](C)N)cc1