Reaction Details
TargetHistamine H2 receptor
LigandBDBM50220440
Substrate/Competitorn/a
Meas. Tech.ChEMBL_85658 (CHEMBL702650)
Ki 13490±n/a nM
Citation Faghih, RDwight, WBlack, LLiu, HGentles, RPhelan, KEsbenshade, TAIreland, LMiller, TRKang, CHKrueger, KMFox, GBHancock, AABennani, YL Structure-activity relationships of non-imidazole H(3) receptor ligands. Part 2: binding preference for D-amino acids motifs. Bioorg Med Chem Lett12:2035-7 (2002) Histamine H2 receptor
Name:Histamine H2 receptor
Type:G Protein-Coupled Receptor (GPCR)
Mol. Mass.:40115.31
Organism:Homo sapiens (Human)
Description:n/a
Residue:359
BDBM50220440
NameBDBM50220440
Synonyms:CHEMBL60598
TypeSmall organic molecule
Emp. Form.C29H47N3O5
Mol. Mass.517.7006
SMILESCCCCCC(=O)c1ccc(OCCCN2CCN(CC2)C(=O)[C@H](NC(=O)OC(C)(C)C)C(C)C)cc1