Reaction Details
TargetGlucocorticoid receptor
LigandBDBM50411039
Substrate/Competitorn/a
Meas. Tech.ChEMBL_372313 (CHEMBL869702)
IC50 6.6±n/a nM
Citation Barker, MClackers, MCopley, RDemaine, DAHumphreys, DInglis, GGJohnston, MJJones, HTHaase, MVHouse, DLoiseau, RNisbet, LPacquet, FSkone, PAShanahan, SETape, DVinader, VMWashington, MUings, IUpton, RMcLay, IMMacdonald, SJ Dissociated nonsteroidal glucocorticoid receptor modulators; discovery of the agonist trigger in a tetrahydronaphthalene-benzoxazine series. J Med Chem49:4216-31 (2006) 
 
Glucocorticoid receptor
Name:Glucocorticoid receptor
Type:Enzyme
Mol. Mass.:85656.87
Organism:Homo sapiens (Human)
Description:P04150
Residue:777
BDBM50411039
NameBDBM50411039
Synonyms:CHEMBL385450
TypeSmall organic molecule
Emp. Form.C27H29F3N2O4
Mol. Mass.502.5254
SMILESCCCCC1(CC(O)(C(=O)Nc2ccc3c(c2)c(C)noc3=O)C(F)(F)F)CCCc2ccccc12