Reaction Details
TargetGlucocorticoid receptor
LigandBDBM50411051
Substrate/Competitorn/a
Meas. Tech.ChEMBL_372312 (CHEMBL869701)
IC50 16±n/a nM
Citation Barker, MClackers, MCopley, RDemaine, DAHumphreys, DInglis, GGJohnston, MJJones, HTHaase, MVHouse, DLoiseau, RNisbet, LPacquet, FSkone, PAShanahan, SETape, DVinader, VMWashington, MUings, IUpton, RMcLay, IMMacdonald, SJ Dissociated nonsteroidal glucocorticoid receptor modulators; discovery of the agonist trigger in a tetrahydronaphthalene-benzoxazine series. J Med Chem49:4216-31 (2006) 
 
Glucocorticoid receptor
Name:Glucocorticoid receptor
Type:Enzyme
Mol. Mass.:85656.87
Organism:Homo sapiens (Human)
Description:P04150
Residue:777
BDBM50411051
NameBDBM50411051
Synonyms:CHEMBL379158
TypeSmall organic molecule
Emp. Form.C24H20F3N3O4
Mol. Mass.471.4285
SMILESCc1noc(=O)c2ccc(NC(=O)C(O)(CC3CCCc4c(cccc34)C#N)C(F)(F)F)cc12