Reaction Details
TargetGlucocorticoid receptor
LigandBDBM50411048
Substrate/Competitorn/a
Meas. Tech.ChEMBL_372313 (CHEMBL869702)
IC50 9.5±n/a nM
Citation Barker, MClackers, MCopley, RDemaine, DAHumphreys, DInglis, GGJohnston, MJJones, HTHaase, MVHouse, DLoiseau, RNisbet, LPacquet, FSkone, PAShanahan, SETape, DVinader, VMWashington, MUings, IUpton, RMcLay, IMMacdonald, SJ Dissociated nonsteroidal glucocorticoid receptor modulators; discovery of the agonist trigger in a tetrahydronaphthalene-benzoxazine series. J Med Chem49:4216-31 (2006) 
 
Glucocorticoid receptor
Name:Glucocorticoid receptor
Type:Enzyme
Mol. Mass.:85656.87
Organism:Homo sapiens (Human)
Description:P04150
Residue:777
BDBM50411048
NameBDBM50411048
Synonyms:CHEMBL386448
TypeSmall organic molecule
Emp. Form.C26H25F3N2O4
Mol. Mass.486.4829
SMILESCc1noc(=O)c2ccc(NC(=O)C(O)(CC3(CCCc4ccccc34)C3CC3)C(F)(F)F)cc12