Reaction Details
TargetParathyroid hormone/parathyroid hormone-related peptide receptor
LigandBDBM50411364
Substrate/Competitorn/a
Meas. Tech.ChEMBL_446293 (CHEMBL895396)
Ki 13±n/a nM
Citation McDonald, IMAustin, CBuck, IMDunstone, DJGaffen, JGriffin, EHarper, EAHull, RAKalindjian, SBLinney, IDLow, CMPatel, DPether, MJRaynor, MRoberts, SPShaxted, MESpencer, JSteel, KISykes, DAWright, PTXun, W Discovery and characterization of novel, potent, non-peptide parathyroid hormone-1 receptor antagonists. J Med Chem50:4789-92 (2007) 
 
Parathyroid hormone/parathyroid hormone-related peptide receptor
Name:Parathyroid hormone/parathyroid hormone-related peptide receptor
Type:Enzyme Catalytic Domain
Mol. Mass.:66370.95
Organism:Homo sapiens (Human)
Description:PARATHYROID HT1 0 HUMAN::Q03431
Residue:593
BDBM50411364
NameBDBM50411364
Synonyms:CHEMBL242784
TypeSmall organic molecule
Emp. Form.C27H32N6O
Mol. Mass.456.5826
SMILESCN1N=C(C2CCCCC2)c2ccc(C)cc2N(c2ccc(NCCc3ncc[nH]3)cc2)C1=O