Reaction Details
TargetCoproporphyrinogen III oxidase
LigandBDBM50414820
Substrate/Competitorn/a
Meas. Tech.ChEMBL_588025 (CHEMBL1048360)
Ki 60.26±n/a nM
Citation Zhang, LHao, GFTan, YXi, ZHuang, MZYang, GF Bioactive conformation analysis of cyclic imides as protoporphyrinogen oxidase inhibitor by combining DFT calculations, QSAR and molecular dynamic simulations. Bioorg Med Chem17:4935-42 (2009) 
 
Coproporphyrinogen III oxidase
Name:Coproporphyrinogen III oxidase
Type:PROTEIN
Mol. Mass.:51210.88
Organism:Bacillus subtilis (strain 168)
Description:ChEMBL_588025
Residue:470
BDBM50414820
NameBDBM50414820
Synonyms:CHEMBL576943
TypeSmall organic molecule
Emp. Form.C21H21FN2O6
Mol. Mass.416.3996
SMILESCCOC(=O)CN1C(=O)C(C)Oc2cc(F)c(cc12)N1C(=O)C2=C(CCCC2)C1=O