Reaction Details
TargetCoproporphyrinogen III oxidase
LigandBDBM50414823
Substrate/Competitorn/a
Meas. Tech.ChEMBL_588025 (CHEMBL1048360)
Ki 91.2±n/a nM
Citation Zhang, LHao, GFTan, YXi, ZHuang, MZYang, GF Bioactive conformation analysis of cyclic imides as protoporphyrinogen oxidase inhibitor by combining DFT calculations, QSAR and molecular dynamic simulations. Bioorg Med Chem17:4935-42 (2009) 
 
Coproporphyrinogen III oxidase
Name:Coproporphyrinogen III oxidase
Type:PROTEIN
Mol. Mass.:51210.88
Organism:Bacillus subtilis (strain 168)
Description:ChEMBL_588025
Residue:470
BDBM50414823
NameBDBM50414823
Synonyms:CHEMBL577788
TypeSmall organic molecule
Emp. Form.C27H25FN2O6
Mol. Mass.492.4956
SMILESCCOC(=O)C(N1C(=O)C(C)Oc2cc(F)c(cc12)N1C(=O)C2=C(CCCC2)C1=O)c1ccccc1