Reaction Details
TargetCoproporphyrinogen III oxidase
LigandBDBM50414833
Substrate/Competitorn/a
Meas. Tech.ChEMBL_588025 (CHEMBL1048360)
Ki 8.32±n/a nM
Citation Zhang, LHao, GFTan, YXi, ZHuang, MZYang, GF Bioactive conformation analysis of cyclic imides as protoporphyrinogen oxidase inhibitor by combining DFT calculations, QSAR and molecular dynamic simulations. Bioorg Med Chem17:4935-42 (2009) 
 
Coproporphyrinogen III oxidase
Name:Coproporphyrinogen III oxidase
Type:PROTEIN
Mol. Mass.:51210.88
Organism:Bacillus subtilis (strain 168)
Description:ChEMBL_588025
Residue:470
BDBM50414833
NameBDBM50414833
Synonyms:CHEMBL573409
TypeSmall organic molecule
Emp. Form.C22H15Cl2F2N3O4
Mol. Mass.494.275
SMILESFc1cccc(Cl)c1C(=O)NC(=O)Nc1cc(N2C(=O)C3=C(CCCC3)C2=O)c(F)cc1Cl