Reaction Details
TargetcAMP-specific 3',5'-cyclic phosphodiesterase 4B
LigandBDBM50414999
Substrate/Competitorn/a
Meas. Tech.ChEMBL_599733 (CHEMBL1048177)
IC50 0.01±n/a nM
Citation Woodrow, MDBallantine, SPBarker, MDClarke, BJDawson, JDean, TWDelves, CJEvans, BGough, SLGuntrip, SBHolman, SHolmes, DSKranz, MLindvaal, MKLucas, FSNeu, MRanshaw, LESolanke, YESomers, DOWard, PWiseman, JO Quinolines as a novel structural class of potent and selective PDE4 inhibitors. Optimisation for inhaled administration. Bioorg Med Chem Lett19:5261-5 (2009) 
 
cAMP-specific 3',5'-cyclic phosphodiesterase 4B
Name:cAMP-specific 3',5'-cyclic phosphodiesterase 4B
Type:Protein
Mol. Mass.:83318.87
Organism:Homo sapiens (Human)
Description:Q07343
Residue:736
BDBM50414999
NameBDBM50414999
Synonyms:CHEMBL569791
TypeSmall organic molecule
Emp. Form.C26H24N4O5S
Mol. Mass.504.558
SMILESCOc1cccc(Nc2c(cnc3ccc(cc23)S(=O)(=O)c2cccc(c2)C(=O)N(C)C)C(N)=O)c1