Reaction Details
TargetcAMP-specific 3',5'-cyclic phosphodiesterase 4B
LigandBDBM50415008
Substrate/Competitorn/a
Meas. Tech.ChEMBL_599733 (CHEMBL1048177)
IC50 0.1±n/a nM
Citation Woodrow, MDBallantine, SPBarker, MDClarke, BJDawson, JDean, TWDelves, CJEvans, BGough, SLGuntrip, SBHolman, SHolmes, DSKranz, MLindvaal, MKLucas, FSNeu, MRanshaw, LESolanke, YESomers, DOWard, PWiseman, JO Quinolines as a novel structural class of potent and selective PDE4 inhibitors. Optimisation for inhaled administration. Bioorg Med Chem Lett19:5261-5 (2009) 
 
cAMP-specific 3',5'-cyclic phosphodiesterase 4B
Name:cAMP-specific 3',5'-cyclic phosphodiesterase 4B
Type:Protein
Mol. Mass.:83318.87
Organism:Homo sapiens (Human)
Description:Q07343
Residue:736
BDBM50415008
NameBDBM50415008
Synonyms:CHEMBL584327
TypeSmall organic molecule
Emp. Form.C24H21N3O4S
Mol. Mass.447.506
SMILESCOc1cccc(Nc2c(cnc3c(C)cc(cc23)S(=O)(=O)c2ccccc2)C(N)=O)c1