Reaction Details
TargetCannabinoid receptor 1
LigandBDBM50418006
Substrate/Competitorn/a
Meas. Tech.ChEMBL_728033 (CHEMBL1686904)
EC50 158.49±n/a nM
Citation Kiyoi, TAdam, JMClark, JKDavies, KEasson, AMEdwards, DFeilden, HFields, RFrancis, SJeremiah, FMcArthur, DMorrison, AJProsser, ARatcliffe, PDSchulz, JWishart, GBaker, JCampbell, RCottney, JEDeehan, MEpemolu, OEvans, L Discovery of potent and orally bioavailable heterocycle-based cannabinoid CB1 receptor agonists. Bioorg Med Chem Lett21:1748-53 (2011) 
 
Cannabinoid receptor 1
Name:Cannabinoid receptor 1
Type:G Protein-Coupled Receptor (GPCR)
Mol. Mass.:52868.96
Organism:Homo sapiens (Human)
Description:P21554
Residue:472
BDBM50418006
NameBDBM50418006
Synonyms:CHEMBL1682265
TypeSmall organic molecule
Emp. Form.C22H25ClN4O3S
Mol. Mass.460.977
SMILESOC(=O)C1CCCN1Cc1nc(ns1)-c1cn(CC2CCOCC2)c2c(Cl)cccc12