Reaction Details
TargetCannabinoid receptor 1
LigandBDBM50418013
Substrate/Competitorn/a
Meas. Tech.ChEMBL_728033 (CHEMBL1686904)
EC50 31.62±n/a nM
Citation Kiyoi, TAdam, JMClark, JKDavies, KEasson, AMEdwards, DFeilden, HFields, RFrancis, SJeremiah, FMcArthur, DMorrison, AJProsser, ARatcliffe, PDSchulz, JWishart, GBaker, JCampbell, RCottney, JEDeehan, MEpemolu, OEvans, L Discovery of potent and orally bioavailable heterocycle-based cannabinoid CB1 receptor agonists. Bioorg Med Chem Lett21:1748-53 (2011) 
 
Cannabinoid receptor 1
Name:Cannabinoid receptor 1
Type:G Protein-Coupled Receptor (GPCR)
Mol. Mass.:52868.96
Organism:Homo sapiens (Human)
Description:P21554
Residue:472
BDBM50418013
NameBDBM50418013
Synonyms:CHEMBL1682278
TypeSmall organic molecule
Emp. Form.C20H26ClN5O4S
Mol. Mass.467.97
SMILESCN(C)S(=O)(=O)N(C)Cc1nc(no1)-c1cn(CC2CCOCC2)c2c(Cl)cccc12