Reaction Details
TargetCannabinoid receptor 1
LigandBDBM50418018
Substrate/Competitorn/a
Meas. Tech.ChEMBL_728033 (CHEMBL1686904)
EC50 1995.26±n/a nM
Citation Kiyoi, TAdam, JMClark, JKDavies, KEasson, AMEdwards, DFeilden, HFields, RFrancis, SJeremiah, FMcArthur, DMorrison, AJProsser, ARatcliffe, PDSchulz, JWishart, GBaker, JCampbell, RCottney, JEDeehan, MEpemolu, OEvans, L Discovery of potent and orally bioavailable heterocycle-based cannabinoid CB1 receptor agonists. Bioorg Med Chem Lett21:1748-53 (2011) 
 
Cannabinoid receptor 1
Name:Cannabinoid receptor 1
Type:G Protein-Coupled Receptor (GPCR)
Mol. Mass.:52868.96
Organism:Homo sapiens (Human)
Description:P21554
Residue:472
BDBM50418018
NameBDBM50418018
Synonyms:CHEMBL1682277
TypeSmall organic molecule
Emp. Form.C20H24ClN5O3
Mol. Mass.417.889
SMILESCCNC(=O)NCc1nc(no1)-c1cn(CC2CCOCC2)c2c(Cl)cccc12