Reaction Details
Target40S ribosomal protein S27
LigandBDBM50420401
Substrate/Competitorn/a
Meas. Tech.ChEMBL_840521 (CHEMBL2089872)
IC50 6.4±n/a nM
Citation Kusakabe, KIde, NDaigo, YItoh, THigashino, KOkano, YTadano, GTachibana, YSato, YInoue, MWada, TIguchi, MKanazawa, TIshioka, YDohi, KTagashira, SKido, YSakamoto, SYasuo, KMaeda, MYamamoto, THigaki, MEndoh, TUeda, KShiota, TMurai, HNakamura, Y Diaminopyridine-based potent and selective mps1 kinase inhibitors binding to an unusual flipped-Peptide conformation. ACS Med Chem Lett3:560-564 (2012) 
 
40S ribosomal protein S27
Name:40S ribosomal protein S27
Type:PROTEIN
Mol. Mass.:9472.13
Organism:Homo sapiens (Human)
Description:ChEMBL_1446775
Residue:84
BDBM50420401
NameBDBM50420401
Synonyms:CHEMBL2089255 | US11208696, Example 31
TypeSmall organic molecule
Emp. Form.C17H20N6O
Mol. Mass.324.3803
SMILESCC(C)(C)Nc1nc(Nc2ccc(cc2)C(N)=O)cc(N)c1C#N