Reaction Details
TargetHistamine H1 receptor
LigandBDBM22864
Substrate/Competitorn/a
Meas. Tech.ChEMBL_84547 (CHEMBL692983)
IC50 794±n/a nM
Citation Govoni, MBakker, RAvan de Wetering, ISmit, MJMenge, WMTimmerman, HElz, SSchunack, WLeurs, R Synthesis and pharmacological identification of neutral histamine H1-receptor antagonists. J Med Chem46:5812-24 (2003) 
 
Histamine H1 receptor
Name:Histamine H1 receptor
Type:G Protein-Coupled Receptor (GPCR)
Mol. Mass.:55808.72
Organism:Homo sapiens (Human)
Description:Cell pellets from SK-N-MC cells transfected with human H1 receptor were used in binding assay.
Residue:487
BDBM22864
NameBDBM22864
Synonyms:2-[2-(3,3-diphenylpropyl)-1H-imidazol-4-yl]ethan-1-amine | Histaprodifen
TypeSmall organic molecule
Emp. Form.C20H23N3
Mol. Mass.305.4167
SMILESNCCc1cnc(CCC(c2ccccc2)c2ccccc2)[nH]1