Reaction Details
TargetCannabinoid receptor 2
LigandBDBM50424477
Substrate/Competitorn/a
Meas. Tech.ChEMBL_937024 (CHEMBL2317163)
IC50 1200±n/a nM
Citation Plowright, ATNilsson, KAntonsson, MAmin, KBroddefalk, JJensen, JLehmann, AJin, SSt-Onge, STomaszewski, MJTremblay, MWalpole, CWei, ZYang, HUlander, J Discovery of agonists of cannabinoid receptor 1 with restricted central nervous system penetration aimed for treatment of gastroesophageal reflux disease. J Med Chem56:220-40 (2013) 
 
Cannabinoid receptor 2
Name:Cannabinoid receptor 2
Type:G Protein-Coupled Receptor (GPCR)
Mol. Mass.:39690.94
Organism:Homo sapiens (Human)
Description:P34972
Residue:360
BDBM50424477
NameBDBM50424477
Synonyms:CHEMBL2316379
TypeSmall organic molecule
Emp. Form.C26H26N6O3
Mol. Mass.470.523
SMILESO=C(NCC1CCOCC1)c1ncccc1NC(=O)c1ccc(Cn2ccnn2)c2ccccc12