Reaction Details
TargetCannabinoid receptor 2
LigandBDBM50424483
Substrate/Competitorn/a
Meas. Tech.ChEMBL_937024 (CHEMBL2317163)
IC50>10000±n/a nM
Citation Plowright, ATNilsson, KAntonsson, MAmin, KBroddefalk, JJensen, JLehmann, AJin, SSt-Onge, STomaszewski, MJTremblay, MWalpole, CWei, ZYang, HUlander, J Discovery of agonists of cannabinoid receptor 1 with restricted central nervous system penetration aimed for treatment of gastroesophageal reflux disease. J Med Chem56:220-40 (2013) 
 
Cannabinoid receptor 2
Name:Cannabinoid receptor 2
Type:G Protein-Coupled Receptor (GPCR)
Mol. Mass.:39690.94
Organism:Homo sapiens (Human)
Description:P34972
Residue:360
BDBM50424483
NameBDBM50424483
Synonyms:CHEMBL2316400
TypeSmall organic molecule
Emp. Form.C21H21N5O3
Mol. Mass.391.4231
SMILESO=C(Nc1cccnc1C(=O)NCC1CCOCC1)c1cccc2nccnc12