Reaction Details
TargetCannabinoid receptor 1
LigandBDBM50424491
Substrate/Competitorn/a
Meas. Tech.ChEMBL_937025 (CHEMBL2317164)
IC50 0.970000±n/a nM
Citation Plowright, ATNilsson, KAntonsson, MAmin, KBroddefalk, JJensen, JLehmann, AJin, SSt-Onge, STomaszewski, MJTremblay, MWalpole, CWei, ZYang, HUlander, J Discovery of agonists of cannabinoid receptor 1 with restricted central nervous system penetration aimed for treatment of gastroesophageal reflux disease. J Med Chem56:220-40 (2013) 
 
Cannabinoid receptor 1
Name:Cannabinoid receptor 1
Type:G Protein-Coupled Receptor (GPCR)
Mol. Mass.:52868.96
Organism:Homo sapiens (Human)
Description:P21554
Residue:472
BDBM50424491
NameBDBM50424491
Synonyms:CHEMBL2316377
TypeSmall organic molecule
Emp. Form.C26H26N6O3
Mol. Mass.470.523
SMILESCOc1ccc(NC(=O)c2ccc(Cn3ccnn3)c3ccccc23)c(n1)C(=O)NCC1CCC1