Reaction Details
TargetCannabinoid receptor 1
LigandBDBM50424458
Substrate/Competitorn/a
Meas. Tech.ChEMBL_937025 (CHEMBL2317164)
IC50 73000±n/a nM
Citation Plowright, ATNilsson, KAntonsson, MAmin, KBroddefalk, JJensen, JLehmann, AJin, SSt-Onge, STomaszewski, MJTremblay, MWalpole, CWei, ZYang, HUlander, J Discovery of agonists of cannabinoid receptor 1 with restricted central nervous system penetration aimed for treatment of gastroesophageal reflux disease. J Med Chem56:220-40 (2013) 
 
Cannabinoid receptor 1
Name:Cannabinoid receptor 1
Type:G Protein-Coupled Receptor (GPCR)
Mol. Mass.:52868.96
Organism:Homo sapiens (Human)
Description:P21554
Residue:472
BDBM50424458
NameBDBM50424458
Synonyms:CHEMBL2316388
TypeSmall organic molecule
Emp. Form.C23H24N4O4
Mol. Mass.420.4611
SMILESOCCOc1ccc(NC(=O)c2ccnc3ccccc23)c(n1)C(=O)NCC1CCC1