Reaction Details
TargetCannabinoid receptor 1
LigandBDBM50424462
Substrate/Competitorn/a
Meas. Tech.ChEMBL_937025 (CHEMBL2317164)
IC50 89000±n/a nM
Citation Plowright, ATNilsson, KAntonsson, MAmin, KBroddefalk, JJensen, JLehmann, AJin, SSt-Onge, STomaszewski, MJTremblay, MWalpole, CWei, ZYang, HUlander, J Discovery of agonists of cannabinoid receptor 1 with restricted central nervous system penetration aimed for treatment of gastroesophageal reflux disease. J Med Chem56:220-40 (2013) 
 
Cannabinoid receptor 1
Name:Cannabinoid receptor 1
Type:G Protein-Coupled Receptor (GPCR)
Mol. Mass.:52868.96
Organism:Homo sapiens (Human)
Description:P21554
Residue:472
BDBM50424462
NameBDBM50424462
Synonyms:CHEMBL2316408
TypeSmall organic molecule
Emp. Form.C27H26N4O2
Mol. Mass.438.5209
SMILESO=C(NCC1CCC1)c1ncccc1NC(=O)c1ccc(Cn2cccc2)c2ccccc12