Reaction Details
TargetCannabinoid receptor 1
LigandBDBM50424476
Substrate/Competitorn/a
Meas. Tech.ChEMBL_937027 (CHEMBL2317166)
EC50 11±n/a nM
Citation Plowright, ATNilsson, KAntonsson, MAmin, KBroddefalk, JJensen, JLehmann, AJin, SSt-Onge, STomaszewski, MJTremblay, MWalpole, CWei, ZYang, HUlander, J Discovery of agonists of cannabinoid receptor 1 with restricted central nervous system penetration aimed for treatment of gastroesophageal reflux disease. J Med Chem56:220-40 (2013) 
 
Cannabinoid receptor 1
Name:Cannabinoid receptor 1
Type:G Protein-Coupled Receptor (GPCR)
Mol. Mass.:52868.96
Organism:Homo sapiens (Human)
Description:P21554
Residue:472
BDBM50424476
NameBDBM50424476
Synonyms:CHEMBL2316381
TypeSmall organic molecule
Emp. Form.C29H29F3N6O6S
Mol. Mass.646.637
SMILESFC(F)(F)CCS(=O)(=O)Oc1ccc(NC(=O)c2ccc(Cn3ccnn3)c3ccccc23)c(n1)C(=O)NCC1CCOCC1