Reaction Details
TargetFatty-acid amide hydrolase 1
LigandBDBM26740
Substrate/Competitorn/a
Meas. Tech.ChEMBL_939362 (CHEMBL2327497)
IC50 16±n/a nM
Citation Kono, MMatsumoto, TKawamura, TNishimura, AKiyota, YOki, HMiyazaki, JIgaki, SBehnke, CAShimojo, MKori, M Synthesis, SAR study, and biological evaluation of a series of piperazine ureas as fatty acid amide hydrolase (FAAH) inhibitors. Bioorg Med Chem21:28-41 (2012) 
 
Fatty-acid amide hydrolase 1
Name:Fatty-acid amide hydrolase 1
Type:Protein
Mol. Mass.:63071.19
Organism:Homo sapiens (Human)
Description:O00519
Residue:579
BDBM26740
NameBDBM26740
Synonyms:N-phenyl-4-(quinolin-3-ylmethyl)piperidine-1-carboxamide | PF-750
TypeSmall organic molecule
Emp. Form.C22H23N3O
Mol. Mass.345.4375
SMILESO=C(Nc1ccccc1)N1CCC(Cc2cnc3ccccc3c2)CC1