Reaction Details
TargetRetinoic acid receptor RXR-alpha
LigandBDBM50427891
Substrate/Competitorn/a
Meas. Tech.ChEMBL_940885 (CHEMBL2330504)
EC50 19460±n/a nM
Citation Conda-Sheridan, MPark, EJBeck, DEReddy, PVNguyen, TXHu, BChen, LWhite, JJvan Breemen, RBPezzuto, JMCushman, M Design, synthesis, and biological evaluation of indenoisoquinoline rexinoids with chemopreventive potential. J Med Chem56:2581-605 (2013) 
 
Retinoic acid receptor RXR-alpha
Name:Retinoic acid receptor RXR-alpha
Type:PROTEIN
Mol. Mass.:50820.38
Organism:Homo sapiens (Human)
Description:ChEMBL_1456363
Residue:462
BDBM50427891
NameBDBM50427891
Synonyms:CHEMBL2323836
TypeSmall organic molecule
Emp. Form.C23H22N2O4
Mol. Mass.390.4318
SMILESCOC(=O)c1ccc2c3C(=O)c4ccccc4-c3n(CCCN(C)C)c(=O)c2c1