Reaction Details
TargetSerine/threonine-protein kinase mTOR
LigandBDBM50428116
Substrate/Competitorn/a
Meas. Tech.ChEMBL_944958 (CHEMBL2343997)
Ki 47±n/a nM
Citation Cheng, HLi, CBailey, SBaxi, SMGoulet, LGuo, LHoffman, JJiang, YJohnson, TOJohnson, TWKnighton, DRLi, JLiu, KKLiu, ZMarx, MAWalls, MWells, PAYin, MJZhu, JZientek, M Discovery of the Highly Potent PI3K/mTOR Dual Inhibitor PF-04979064 through Structure-Based Drug Design. ACS Med Chem Lett4:91-7 (2013) 
 
Serine/threonine-protein kinase mTOR
Name:Serine/threonine-protein kinase mTOR
Type:Rapamycin target protein
Mol. Mass.:288917.12
Organism:Homo sapiens (Human)
Description:P42345
Residue:2549
BDBM50428116
NameBDBM50428116
Synonyms:CHEMBL2331660
TypeSmall organic molecule
Emp. Form.C22H24N6O2
Mol. Mass.404.465
SMILESCOc1ccc(cn1)-c1ccc2ncc3n(C)c(=O)n(C4CCN(C)CC4)c3c2n1