Reaction Details
TargetCytochrome P450 3A4
LigandBDBM50428865
Substrate/Competitorn/a
Meas. Tech.ChEMBL_945618 (CHEMBL2344952)
IC50 1000±n/a nM
Citation Taygerly, JPMcGee, LRRubenstein, SMHouze, JBCushing, TDLi, YMotani, AChen, JLFrankmoelle, WYe, GLearned, MRJaen, JMiao, STimmermans, PBThoolen, MKearney, PFlygare, JBeckmann, HWeiszmann, JLindstrom, MWalker, NLiu, JBiermann, DWang, ZHagiwara, AIida, TAramaki, HKitao, YShinkai, HFurukawa, NNishiu, JNakamura, M Discovery of INT131: a selective PPAR¿ modulator that enhances insulin sensitivity. Bioorg Med Chem21:979-92 (2013) 
 
Cytochrome P450 3A4
Name:Cytochrome P450 3A4
Type:Enzyme
Mol. Mass.:57349.57
Organism:Homo sapiens (Human)
Description:n/a
Residue:503
BDBM50428865
NameBDBM50428865
Synonyms:CHEMBL2338477
TypeSmall organic molecule
Emp. Form.C21H12Cl4N2O3S
Mol. Mass.514.209
SMILESClc1ccc(c(Cl)c1)S(=O)(=O)Nc1cc(Cl)c(Oc2ccc3ncccc3c2)c(Cl)c1