Reaction Details
TargetPeroxisome proliferator-activated receptor gamma
LigandBDBM50428868
Substrate/Competitorn/a
Meas. Tech.ChEMBL_946080 (CHEMBL2342573)
EC50 400±n/a nM
Citation Taygerly, JPMcGee, LRRubenstein, SMHouze, JBCushing, TDLi, YMotani, AChen, JLFrankmoelle, WYe, GLearned, MRJaen, JMiao, STimmermans, PBThoolen, MKearney, PFlygare, JBeckmann, HWeiszmann, JLindstrom, MWalker, NLiu, JBiermann, DWang, ZHagiwara, AIida, TAramaki, HKitao, YShinkai, HFurukawa, NNishiu, JNakamura, M Discovery of INT131: a selective PPAR¿ modulator that enhances insulin sensitivity. Bioorg Med Chem21:979-92 (2013) 
 
Peroxisome proliferator-activated receptor gamma
Name:Peroxisome proliferator-activated receptor gamma
Type:Nuclear Receptor
Mol. Mass.:57613.46
Organism:Homo sapiens (Human)
Description:P37231
Residue:505
BDBM50428868
NameBDBM50428868
Synonyms:CHEMBL2331782
TypeSmall organic molecule
Emp. Form.C17H10Cl4N2O3S
Mol. Mass.464.15
SMILESClc1ccc(c(Cl)c1)S(=O)(=O)Nc1ccc(Oc2cncc(Cl)c2)c(Cl)c1