Reaction Details
TargetPeroxisome proliferator-activated receptor gamma
LigandBDBM50428876
Substrate/Competitorn/a
Meas. Tech.ChEMBL_946081 (CHEMBL2342574)
IC50 31±n/a nM
Citation Taygerly, JPMcGee, LRRubenstein, SMHouze, JBCushing, TDLi, YMotani, AChen, JLFrankmoelle, WYe, GLearned, MRJaen, JMiao, STimmermans, PBThoolen, MKearney, PFlygare, JBeckmann, HWeiszmann, JLindstrom, MWalker, NLiu, JBiermann, DWang, ZHagiwara, AIida, TAramaki, HKitao, YShinkai, HFurukawa, NNishiu, JNakamura, M Discovery of INT131: a selective PPAR¿ modulator that enhances insulin sensitivity. Bioorg Med Chem21:979-92 (2013) 
 
Peroxisome proliferator-activated receptor gamma
Name:Peroxisome proliferator-activated receptor gamma
Type:Nuclear Receptor
Mol. Mass.:57613.46
Organism:Homo sapiens (Human)
Description:P37231
Residue:505
BDBM50428876
NameBDBM50428876
Synonyms:CHEMBL2338478
TypeSmall organic molecule
Emp. Form.C19H9Cl3F6N2O3S
Mol. Mass.565.701
SMILESFC(F)(F)c1cc(NS(=O)(=O)c2ccc(Cl)cc2Cl)cc(c1Oc1cncc(Cl)c1)C(F)(F)F