Reaction Details
TargetPeroxisome proliferator-activated receptor gamma
LigandBDBM50428871
Substrate/Competitorn/a
Meas. Tech.ChEMBL_946081 (CHEMBL2342574)
IC50 25±n/a nM
Citation Taygerly, JPMcGee, LRRubenstein, SMHouze, JBCushing, TDLi, YMotani, AChen, JLFrankmoelle, WYe, GLearned, MRJaen, JMiao, STimmermans, PBThoolen, MKearney, PFlygare, JBeckmann, HWeiszmann, JLindstrom, MWalker, NLiu, JBiermann, DWang, ZHagiwara, AIida, TAramaki, HKitao, YShinkai, HFurukawa, NNishiu, JNakamura, M Discovery of INT131: a selective PPAR¿ modulator that enhances insulin sensitivity. Bioorg Med Chem21:979-92 (2013) 
 
Peroxisome proliferator-activated receptor gamma
Name:Peroxisome proliferator-activated receptor gamma
Type:Nuclear Receptor
Mol. Mass.:57613.46
Organism:Homo sapiens (Human)
Description:P37231
Residue:505
BDBM50428871
NameBDBM50428871
Synonyms:CHEMBL2331785
TypeSmall organic molecule
Emp. Form.C21H18Cl3N3O4S
Mol. Mass.514.809
SMILESCCNC(=O)c1cc(NS(=O)(=O)c2cc(C)c(Cl)cc2Cl)ccc1Oc1cncc(Cl)c1