Reaction Details
TargetProstaglandin G/H synthase 2
LigandBDBM50430954
Substrate/Competitorn/a
Meas. Tech.ChEMBL_946397 (CHEMBL2339174)
IC50 27±n/a nM
Citation Anzini, MDi Capua, AValenti, SBrogi, SRovini, MGiuliani, GCappelli, AVomero, SChiasserini, LSega, APoce, GGiorgi, GCalderone, VMartelli, ATestai, LSautebin, LRossi, APace, SGhelardini, CDi Cesare Mannelli, LBenetti, VGiordani, AAnzellotti, PDovizio, MPatrignani, PBiava, M Novel analgesic/anti-inflammatory agents: 1,5-diarylpyrrole nitrooxyalkyl ethers and related compounds as cyclooxygenase-2 inhibiting nitric oxide donors. J Med Chem56:3191-206 (2013) 
 
Prostaglandin G/H synthase 2
Name:Prostaglandin G/H synthase 2
Type:Protein
Mol. Mass.:69020.39
Organism:Mus musculus (Mouse)
Description:Q05769
Residue:604
BDBM50430954
NameBDBM50430954
Synonyms:CHEMBL2337407 | US9162979, 36-II
TypeSmall organic molecule
Emp. Form.C22H25NO4S
Mol. Mass.399.503
SMILESCc1c(CCOCCO)cc(-c2ccc(cc2)S(C)(=O)=O)n1-c1ccccc1