Reaction Details
TargetL-lactate dehydrogenase A chain
LigandBDBM50433836
Substrate/Competitorn/a
Meas. Tech.ChEMBL_959389 (CHEMBL2384180)
Kd 6100±n/a nM
Citation Dragovich, PSFauber, BPCorson, LBDing, CZEigenbrot, CGe, HGiannetti, AMHunsaker, TLabadie, SLiu, YMalek, SPan, BPeterson, DPitts, KPurkey, HESideris, SUltsch, MVanderPorten, EWei, BXu, QYen, IYue, QZhang, HZhang, X Identification of substituted 2-thio-6-oxo-1,6-dihydropyrimidines as inhibitors of human lactate dehydrogenase. Bioorg Med Chem Lett23:3186-94 (2013) 
 
L-lactate dehydrogenase A chain
Name:L-lactate dehydrogenase A chain
Type:Protein
Mol. Mass.:36694.85
Organism:Homo sapiens (Human)
Description:P00338::PDB Code: 4ajp
Residue:332
BDBM50433836
NameBDBM50433836
Synonyms:CHEMBL2382337
TypeSmall organic molecule
Emp. Form.C19H14ClN5O4S2
Mol. Mass.475.929
SMILESNS(=O)(=O)c1ccc(NC(=O)CSc2nc(-c3ccc(Cl)cc3)c(C#N)c(=O)[nH]2)cc1