Reaction Details
TargetMalate dehydrogenase, mitochondrial
LigandBDBM23229
Substrate/Competitorn/a
Meas. Tech.ChEMBL_959385 (CHEMBL2384176)
IC50 8480±n/a nM
Citation Dragovich, PSFauber, BPCorson, LBDing, CZEigenbrot, CGe, HGiannetti, AMHunsaker, TLabadie, SLiu, YMalek, SPan, BPeterson, DPitts, KPurkey, HESideris, SUltsch, MVanderPorten, EWei, BXu, QYen, IYue, QZhang, HZhang, X Identification of substituted 2-thio-6-oxo-1,6-dihydropyrimidines as inhibitors of human lactate dehydrogenase. Bioorg Med Chem Lett23:3186-94 (2013) 
 
Malate dehydrogenase, mitochondrial
Name:Malate dehydrogenase, mitochondrial
Type:PROTEIN
Mol. Mass.:35512.45
Organism:Homo sapiens (Human)
Description:ChEMBL_1456625
Residue:338
BDBM23229
NameBDBM23229
Synonyms:Oxamic acid derivative, 7 | [(4-{2-[(5-hydroxy-2-{[(4-methoxyphenyl)methyl]carbamoyl}-4-oxo-4H-chromen-7-yl)oxy]ethyl}-2-methoxyphenyl)carbamoyl]formic acid
TypeSmall organic molecule
Emp. Form.C29H26N2O10
Mol. Mass.562.5241
SMILESCOc1ccc(CNC(=O)c2cc(=O)c3c(O)cc(OCCc4ccc(NC(=O)C(O)=O)c(OC)c4)cc3o2)cc1