Reaction Details
Target11-beta-hydroxysteroid dehydrogenase 1
LigandBDBM50174298
Substrate/Competitorn/a
Meas. Tech.ChEMBL_965016 (CHEMBL2396178)
Ki 1.3±n/a nM
Citation Bauman, DRWhitehead, AContino, LCCui, JGarcia-Calvo, MGu, XKevin, NMa, XPai, LYShah, KShen, XStribling, SZokian, HJMetzger, JShevell, DEWaddell, ST Evaluation of selective inhibitors of 11ß-HSD1 for the treatment of hypertension. Bioorg Med Chem Lett23:3650-3 (2013) 
 
11-beta-hydroxysteroid dehydrogenase 1
Name:11-beta-hydroxysteroid dehydrogenase 1
Type:Enzyme
Mol. Mass.:31889.48
Organism:Rattus norvegicus (rat)
Description:P16232
Residue:288
BDBM50174298
NameBDBM50174298
Synonyms:3-(4-(3-(4-fluorophenyl)-1,2,4-oxadiazol-5-yl)bicyclo[2.2.2]octan-1-yl)-4-methyl-5-(2-(trifluoromethyl)phenyl)-4H-1,2,4-triazole | CHEMBL373257
TypeSmall organic molecule
Emp. Form.C26H23F4N5O
Mol. Mass.497.4873
SMILESCn1c(nnc1C12CCC(CC1)(CC2)c1nc(no1)-c1ccc(F)cc1)-c1ccccc1C(F)(F)F