Reaction Details
Target11-beta-hydroxysteroid dehydrogenase type 2
LigandBDBM50435691
Substrate/Competitorn/a
Meas. Tech.ChEMBL_965017 (CHEMBL2396179)
IC50 30±n/a nM
Citation Bauman, DRWhitehead, AContino, LCCui, JGarcia-Calvo, MGu, XKevin, NMa, XPai, LYShah, KShen, XStribling, SZokian, HJMetzger, JShevell, DEWaddell, ST Evaluation of selective inhibitors of 11ß-HSD1 for the treatment of hypertension. Bioorg Med Chem Lett23:3650-3 (2013) 
 
11-beta-hydroxysteroid dehydrogenase type 2
Name:11-beta-hydroxysteroid dehydrogenase type 2
Type:Enzyme
Mol. Mass.:44141.72
Organism:Homo sapiens (Human)
Description:Purified recombinant human 11beta-HSD2.
Residue:405
BDBM50435691
NameBDBM50435691
Synonyms:CHEMBL2391968
TypeSmall organic molecule
Emp. Form.C22H22F5N5O
Mol. Mass.467.435
SMILESCn1c(nnc1C12CCC(CC1)(CC2)c1noc(n1)C(C)(F)F)-c1ccccc1C(F)(F)F