Reaction Details
TargetTyrosine-protein phosphatase non-receptor type 7
LigandBDBM50436358
Substrate/Competitorn/a
Meas. Tech.ChEMBL_966907 (CHEMBL2401198)
IC50 3000±n/a nM
Citation He, YLiu, SMenon, AStanford, SOppong, EGunawan, AMWu, LWu, DJBarrios, AMBottini, NCato, ACZhang, ZY A potent and selective small-molecule inhibitor for the lymphoid-specific tyrosine phosphatase (LYP), a target associated with autoimmune diseases. J Med Chem56:4990-5008 (2013) 
 
Tyrosine-protein phosphatase non-receptor type 7
Name:Tyrosine-protein phosphatase non-receptor type 7
Type:Protein
Mol. Mass.:40530.79
Organism:Homo sapiens (Human)
Description:P35236
Residue:360
BDBM50436358
NameBDBM50436358
Synonyms:CHEMBL2396718
TypeSmall organic molecule
Emp. Form.C28H22ClNO6
Mol. Mass.503.93
SMILESCCCNC(=O)COc1ccc(cc1)-c1oc2cc(O)c(cc2c1C#Cc1cccc(Cl)c1)C(O)=O