Reaction Details
TargetTyrosine-protein phosphatase non-receptor type 11
LigandBDBM50436358
Substrate/Competitorn/a
Meas. Tech.ChEMBL_966909 (CHEMBL2401200)
IC50 560±n/a nM
Citation He, YLiu, SMenon, AStanford, SOppong, EGunawan, AMWu, LWu, DJBarrios, AMBottini, NCato, ACZhang, ZY A potent and selective small-molecule inhibitor for the lymphoid-specific tyrosine phosphatase (LYP), a target associated with autoimmune diseases. J Med Chem56:4990-5008 (2013) 
 
Tyrosine-protein phosphatase non-receptor type 11
Name:Tyrosine-protein phosphatase non-receptor type 11
Type:Protein phosphatase
Mol. Mass.:68443.59
Organism:Homo sapiens (Human)
Description:Q06124
Residue:593
BDBM50436358
NameBDBM50436358
Synonyms:CHEMBL2396718
TypeSmall organic molecule
Emp. Form.C28H22ClNO6
Mol. Mass.503.93
SMILESCCCNC(=O)COc1ccc(cc1)-c1oc2cc(O)c(cc2c1C#Cc1cccc(Cl)c1)C(O)=O