Reaction Details
TargetCathepsin D
LigandBDBM50438363
Substrate/Competitorn/a
Meas. Tech.ChEMBL_973546 (CHEMBL2410948)
IC50 1.000000±n/a nM
Citation Ng, RASun, MBowers, SHom, RKProbst, GDJohn, VFang, LYMaillard, MGailunas, ABrogley, LNeitz, RJTung, JSPleiss, MAKonradi, AWSham, HLDappen, MSAdler, MYao, NZmolek, WNakamura, DQuinn, KPSauer, JMBova, MPRuslim, LArtis, DRYednock, TA Design and synthesis of hydroxyethylamine (HEA) BACE-1 inhibitors: prime side chromane-containing inhibitors. Bioorg Med Chem Lett23:4674-9 (2013) 
 
Cathepsin D
Name:Cathepsin D
Type:Enzyme
Mol. Mass.:44551.72
Organism:Homo sapiens (Human)
Description:Human proCathepsin D (SwissProt accession number P07339) was expressed in Sf9 cells, purified, and autoactivated.
Residue:412
BDBM50438363
NameBDBM50438363
Synonyms:CHEMBL2408751
TypeSmall organic molecule
Emp. Form.C30H42F2N2O3
Mol. Mass.516.6629
SMILESCCC[C@@]1(C)C[C@H](NC[C@@H](O)[C@H](Cc2cc(F)cc(F)c2)NC(C)=O)c2cc(CC(C)(C)C)ccc2O1