Reaction Details
TargetRenin
LigandBDBM50402224
Substrate/Competitorn/a
Meas. Tech.ChEMBL_979178 (CHEMBL2421978)
IC50 1.6±n/a nM
Citation Mori, YOgawa, YMochizuki, ANakamura, YFujimoto, TSugita, CMiyazaki, STamaki, KNagayama, TNagai, YInoue, SChiba, KNishi, T Synthesis and optimization of novel (3S,5R)-5-(2,2-dimethyl-5-oxo-4-phenylpiperazin-1-yl)piperidine-3-carboxamides as orally active renin inhibitors. Bioorg Med Chem21:5907-22 (2013) 
 
Renin
Name:Renin
Type:Enzyme
Mol. Mass.:45058.99
Organism:Homo sapiens (Human)
Description:n/a
Residue:406
BDBM50402224
NameBDBM50402224
Synonyms:CHEMBL2204739
TypeSmall organic molecule
Emp. Form.C27H43ClN4O2
Mol. Mass.491.109
SMILESCC(C)CC(CC(C)C)NC(=O)[C@@H]1CNC[C@@H](C1)N1CC(=O)N(CC1(C)C)c1ccccc1Cl