Reaction Details
TargetRenin
LigandBDBM50439251
Substrate/Competitorn/a
Meas. Tech.ChEMBL_979178 (CHEMBL2421978)
IC50 1.3±n/a nM
Citation Mori, YOgawa, YMochizuki, ANakamura, YFujimoto, TSugita, CMiyazaki, STamaki, KNagayama, TNagai, YInoue, SChiba, KNishi, T Synthesis and optimization of novel (3S,5R)-5-(2,2-dimethyl-5-oxo-4-phenylpiperazin-1-yl)piperidine-3-carboxamides as orally active renin inhibitors. Bioorg Med Chem21:5907-22 (2013) 
 
Renin
Name:Renin
Type:Enzyme
Mol. Mass.:45058.99
Organism:Homo sapiens (Human)
Description:n/a
Residue:406
BDBM50439251
NameBDBM50439251
Synonyms:CHEMBL2419045
TypeSmall organic molecule
Emp. Form.C29H39F2N5O2
Mol. Mass.527.6491
SMILESCC(C)C[C@@H](NC(=O)[C@@H]1CNC[C@@H](C1)N1CC(=O)N(CC1(C)C)c1cc(F)ccc1C)c1ccc(F)cn1