Reaction Details
TargetCytochrome P450 2C19
LigandBDBM50440365
Substrate/Competitorn/a
Meas. Tech.ChEMBL_983547 (CHEMBL2429617)
IC50>10000±n/a nM
Citation Grädler, UBomke, JMusil, DDresing, VLehmann, MHölzemann, GGreiner, HEsdar, CKrier, MHeinrich, T Fragment-based discovery of focal adhesion kinase inhibitors. Bioorg Med Chem Lett23:5401-9 (2013) 
 
Cytochrome P450 2C19
Name:Cytochrome P450 2C19
Type:Enzyme
Mol. Mass.:55935.47
Organism:Homo sapiens (Human)
Description:P33261
Residue:490
BDBM50440365
NameBDBM50440365
Synonyms:CHEMBL2425149
TypeSmall organic molecule
Emp. Form.C24H24Cl2N6O
Mol. Mass.483.393
SMILESCc1ccc(cc1)-n1nc(cc1NC(=O)Nc1ccc(cc1)-n1cnc(Cl)c1Cl)C(C)(C)C