Reaction Details
TargetCytochrome P450 2C9
LigandBDBM50440353
Substrate/Competitorn/a
Meas. Tech.ChEMBL_983549 (CHEMBL2429619)
IC50>10000±n/a nM
Citation Grädler, UBomke, JMusil, DDresing, VLehmann, MHölzemann, GGreiner, HEsdar, CKrier, MHeinrich, T Fragment-based discovery of focal adhesion kinase inhibitors. Bioorg Med Chem Lett23:5401-9 (2013) 
 
Cytochrome P450 2C9
Name:Cytochrome P450 2C9
Type:Enzyme
Mol. Mass.:55636.33
Organism:Homo sapiens (Human)
Description:P11712
Residue:490
BDBM50440353
NameBDBM50440353
Synonyms:CHEMBL2425161
TypeSmall organic molecule
Emp. Form.C33H33N5O2
Mol. Mass.531.6474
SMILESCc1ccc(cc1)-n1nc(cc1NC(=O)Nc1ccc(cc1)-c1ccc(OCc2ccccc2)nc1)C(C)(C)C